Verkeer en vervoer
type: Concept
narrower: Autobus

CBS begrip
label: CBS concept @en

Autobus
type: Concept
type: CBS begrip
created: 2016-03-23T09:12:08Z
modified: 2022-02-23T15:52:31Z
source: autobus
version info: 1
broader: Verkeer en vervoer
definition: Motorvoertuig ingericht voor het vervoer van negen of meer passagiers (excl. de bestuurder).
definition: Motor vehicle equipped for transporting nine or more passengers (excl. driver). @en
in scheme: Begrippen CBS
preferred label: Bus @en

Begrippen CBS
type: ConceptScheme
preferred label: Concepts Statistics Netherlands @en