Bouwen en wonen
type: Concept
narrower: Starter (woningmarkt)

CBS begrip
label: CBS concept @en

Starter (woningmarkt)
type: Concept
type: CBS begrip
created: 2016-03-23T09:07:58Z
modified: 2022-02-23T15:55:35Z
source: starter--woningmarkt--
version info: 1
broader: Bouwen en wonen
definition: Een huishouden dat na verhuizing hoofdbewoner van een woning is en dat nieuw gevormd is (huwelijk, samenwonen, scheiding, zelfstandig wonen) of geïmmigreerd, of voor de verhuizing geen hoofdbewoner van een woning was.
definition: A newly formed or immigrated household that becomes the new main occupant of a dwelling and that was not a main occupant of a dwelling in the Netherlands before. (A newly formed household is one formed due to marriage, divorce, or leaving home.) @en
in scheme: Begrippen CBS
preferred label: First time buyer/renter @en

Begrippen CBS
type: ConceptScheme
preferred label: Concepts Statistics Netherlands @en