Vrije tijd en cultuur
type: Concept
narrower: Studiezaal archief

CBS begrip
label: CBS concept @en

Studiezaal archief
type: Concept
type: CBS begrip
created: 2016-03-23T09:11:35Z
modified: 2022-02-23T15:55:40Z
source: studiezaal-archief
version info: 1
broader: Vrije tijd en cultuur
definition: Een ruimte in of bij een archiefbewaarplaats met tafels en stoelen waar bezoekers archiefmateriaal kunnen inzien.
definition: An area in or near an archive with tables and chairs where visitors may browse through the archive records. @en
in scheme: Begrippen CBS
preferred label: Study area archive @en

Begrippen CBS
type: ConceptScheme
preferred label: Concepts Statistics Netherlands @en