Verkeer en vervoer
type: Concept
narrower: Spoorwegnet, geëlektrificeerd

CBS begrip
label: CBS concept @en

Spoorwegnet, geëlektrificeerd
type: Concept
type: CBS begrip
created: 2016-03-23T09:14:15Z
modified: 2022-02-23T15:55:32Z
source: spoorwegnet-geelektrificeerd
version info: 1
broader: Verkeer en vervoer
definition: Het deel van het spoorwegnet met een elektrische bovenleiding en daardoor geschikt voor elektrisch aangedreven treinen.
in scheme: Begrippen CBS

Begrippen CBS
type: ConceptScheme
preferred label: Concepts Statistics Netherlands @en