Geografie
type: Concept
narrower: Europese Unie: 25 landen (EU-25)

CBS begrip
label: CBS concept @en

Europese Unie: 25 landen (EU-25)
type: Concept
type: CBS begrip
created: 2016-03-23T09:11:07Z
modified: 2022-02-23T15:53:27Z
source: europese-unie-25-landen--eu-25--
version info: 1
broader: Geografie
definition: De samenstelling van de Europese Unie per 1 mei 2004: België, Duitsland, Cyprus, Denemarken, Estland, Finland, Frankrijk, Griekenland, Hongarije, Ierland, Italië, Letland, Litouwen, Luxemburg, Malta, Nederland, Oostenrijk, Polen, Portugal, Slowakije, Slovenië, Spanje, Tsjechië, Verenigd Koninkrijk en Zweden.
definition: The composition of the European Union from 1 May 2004: Austria, Belgium, Cyprus, Czech Republic, Denmark, Estonia, Finland, France, Germany, Greece, Hungary, Ireland, Italy, Latvia, Lithuania, Luxembourg, Malta, the Netherlands, Poland, Portugal, Slovakia @en
in scheme: Begrippen CBS
preferred label: EU-25 @en
related: Europese Unie

Europese Unie
type: Concept
type: CBS begrip
preferred label: European Union @en
related: Europese Unie: 25 landen (EU-25)

Begrippen CBS
type: ConceptScheme
preferred label: Concepts Statistics Netherlands @en