Bedrijven
type: Concept
narrower: Onderneming

CBS begrip
label: CBS concept @en

Kind-of-activity unit
type: Concept
type: CBS begrip
related: Onderneming

Grote niet-financiële onderneming
type: Concept
type: CBS begrip
related: Onderneming

Onderneming
type: Concept
type: CBS begrip
created: 2016-03-23T09:08:10Z
modified: 2022-02-23T15:54:39Z
source: onderneming
version info: 1
broader: Bedrijven
definition: De statistische eenheid van het productiestelsel van de EU, bestaande uit de kleinste combinatie van juridische eenheden (of hun equivalent). Het is een organisatorische eenheid die goederen en diensten voortbrengt en die een zekere zelfstandige beslissingsbevoegdheid heeft, met name ten aanzien van de bestemming van haar vlottende middelen. Zij kan uit een of meer juridische eenheden bestaan en een of meer activiteiten uitoefenen op een of meer locaties.
definition: 'The statistical unit of the EU's production system, consisting of the smallest combination of legal units (or equivalent). It is an organisational unit that produces goods and services and has a certain degree of independence in power of decision, especi @en
in scheme: Begrippen CBS
preferred label: Enterprise group @en
related: Bedrijf
related: Kind-of-activity unit
related: Vestiging (economische statistiek)
related: Grote niet-financiële onderneming
scope note: De onderneming wordt gezien als een organisatorische eenheid zoals die zich vanuit de economische werkelijkheid aan ons presenteert. Ze vormt de basis voor de vorming van de bedrijfseenheid, vestiging en lokale bedrijfseenheid. De onderneming is een economische entiteit, waarin onder bepaalde omstandigheden diverse juridische eenheden kunnen samenkomen. Bepaalde juridische eenheden oefenen hun activiteiten namelijk uitsluitend ten behoeve van een andere juridische entiteit uit en hebben hun bestaan uitsluitend aan administratieve ( bij voorbeeld fiscale) factoren te danken, terwijl ze vanuit economisch oogpunt niet significant zijn. Hiertoe behoren ook vele van de juridische eenheden zonder werkenden. De werkzaamheden van deze juridische eenheden dienen in vele gevallen te worden gezien als hulpactiviteiten naast de activiteiten van de juridische moedereenheid waarvan zij afhangen en waaraan zij gekoppeld dienen te worden om de voor de economische analyse gebruikte eenheid "onderneming" te vormen.

Vestiging (economische statistiek)
type: Concept
type: CBS begrip
preferred label: Location @en
related: Onderneming

Bedrijf
type: Concept
type: CBS begrip
preferred label: Enterprise @en
related: Onderneming

Begrippen CBS
type: ConceptScheme
preferred label: Concepts Statistics Netherlands @en