Bedrijven
type: Concept
narrower: Eindvoorraad handelsgoederen

CBS begrip
label: CBS concept @en

Eindvoorraad handelsgoederen
type: Concept
type: CBS begrip
created: 2016-03-23T09:19:02Z
modified: 2022-02-23T15:53:22Z
source: eindvoorraad-handelsgoederen
version info: 1
broader: Bedrijven
definition: The value on the balance sheet of commodities at the end of the period under review. @en
definition: Waarde op de balans van handelsgoederen aan het einde van de periode
in scheme: Begrippen CBS
preferred label: Closing stock of commodities @en

Begrippen CBS
type: ConceptScheme
preferred label: Concepts Statistics Netherlands @en