Bedrijven
type: Concept
narrower: Investeringsverwachting lopend/volgend jaar

CBS begrip
label: CBS concept @en

Investeringsverwachting lopend/volgend jaar
type: Concept
type: CBS begrip
created: 2016-03-23T09:06:40Z
modified: 2023-03-29T15:52:14Z
source: investeringsverwachting-lopend-volgend-jaar
version info: 2
broader: Bedrijven
definition: The purchase value of the fixed material assets that will be used in the current or next year. @en
in scheme: Begrippen CBS
preferred label: Expected investments current/next year @en

Begrippen CBS
type: ConceptScheme
preferred label: Concepts Statistics Netherlands @en