Onderwijs
type: Concept
narrower: Leerlingwezen

CBS begrip
label: CBS concept @en

Beroepsbegeleidende leerweg
type: Concept
type: CBS begrip
preferred label: Block or day release programmes @en
related: Leerlingwezen

Leerlingwezen
type: Concept
type: CBS begrip
created: 2016-03-23T09:12:52Z
modified: 2022-02-23T15:54:13Z
source: leerlingwezen
version info: 1
broader: Onderwijs
definition: Onderwijsvorm waarin leerlingen een deel van de week werkzaam zijn in een bedrijf (op basis van een leerovereenkomst) of praktijkleerplaats en één of twee dagen per week naar school gaan.
in scheme: Begrippen CBS
related: Beroepsbegeleidende leerweg
scope note: Het leerlingwezen werd ook wel beroepsbegeleidend onderwijs (bbo) genoemd en is vergelijkbaar met het beroepsonderwijs dat binnen de Wet Educatie en Beroepsonderwijs (WEB; vanaf 1997/'98) onder de beroepsbegeleidende leerweg (bbl) valt.

Begrippen CBS
type: ConceptScheme
preferred label: Concepts Statistics Netherlands @en