Overheid en politiek
type: Concept
narrower: Stadsgewest

CBS begrip
label: CBS concept @en

Stadsgewest
type: Concept
type: CBS begrip
created: 2016-03-23T09:06:28Z
modified: 2022-02-23T15:55:33Z
source: stadsgewest
version info: 1
broader: Overheid en politiek
definition: Grootstedelijke agglomeratie en het hierop georiënteerde omringende gebied.
definition: Metropolitan agglomeration plus surrounding area focussed on the city. @en
in scheme: Begrippen CBS
preferred label: Urban region @en
related: Grootstedelijke agglomeratie
scope note: Het stadsgewest - het stedelijk gebied in functionele zin - bestaat uit een grootstedelijke agglomeratie en het omringende gebied met daarbinnen gelegen kleinere kernen (stadjes, dorpen, gehuchten) die met die agglomeratie door velerlei relaties met elkaar zijn verbonden. Die relaties hebben betrekking op het dagelijks verkeer tussen woon- en werkplaats, verhuizingen van huishoudens en bedrijven en het gebruik van stedelijke voorzieningen. Als zodanig kan het stadsgewest daarom worden beschouwd als een combinatie van een regionaal arbeid-, woning- en verzorgingsgebied. Voor de relaties tussen een grootstedelijke agglomeratie en het omringende gebied zijn twee criteria gehanteerd, namelijk: - Forensenstromen op basis van gegevens over de woon- en werkgemeente afkomstig van de Enquête Beroepsbevolking over de gecombineerde verslagjaren 1995 tot en met 1997; - Verhuizingen binnen en tussen gemeenten afkomstig van de statistieken van de binnengemeentelijke verhuizingen en de binnenlandse migratie over de gecombineerde verslagjaren 1996 tot en met 1997. Voor ieder gehanteerd criterium is een niet-hiërarchische clusteranalyse uitgevoerd met een symmetrisch algoritme, waarna de uitkomsten daarvan in hun onderlinge samenhang zijn geanalyseerd. De uiteindelijke afbakening van de grootstedelijke agglomeraties en de stadsgewesten heeft plaatsgevonden in nauw overleg met de Commissie van Advies voor de Regionale Statistieken. Hierin hadden de belangrijkste gebruikers van de regionale gegevens van het CBS (ministeries, gemeenten, planbureaus, wetenschap en bedrijfsleven) zitting. De indeling in stadsgewesten is niet landelijk dekkend en is beschikbaar vanaf 1 januari 2000. Het aantal stadsgewesten bedraagt 22.

Grootstedelijke agglomeratie
type: Concept
type: CBS begrip
preferred label: Metropolitan agglomeration @en
related: Stadsgewest

Begrippen CBS
type: ConceptScheme
preferred label: Concepts Statistics Netherlands @en