Bevolking
type: Concept
narrower: Vestigingsregister (bevolking)

CBS begrip
label: CBS concept @en

Vestigingsregister (bevolking)
type: Concept
type: CBS begrip
created: 2016-03-23T09:06:01Z
modified: 2022-02-23T15:56:09Z
source: vestigingsregister--bevolking--
version info: 1
broader: Bevolking
definition: Voorziening binnen de gemeentelijke bevolkingsregisters om dubbele inschrijving van personen te voorkomen.
definition: A provision in the municipal population register to prevent double entries. @en
in scheme: Begrippen CBS
preferred label: Register of new residencies @en
scope note: Een gemeente mag voor een immigrant pas een persoonslijst aanleggen nadat bij het Vestigingsregister is nagegaan dat van deze persoon nog geen persoonslijst bestaat. Bij opschorting van de bijhouding van een persoonslijst ten gevolge van emigratie of administratieve afvoering stelt de gemeente het Vestigingsregister hiervan in kennis. Een dergelijke persoonslijst blijft bij de gemeente tot wiens bevolking de emigrant het laatst behoorde. Bij hervestiging in Nederland wordt de opschorting van de bijhouding van de persoonslijst ongedaan gemaakt.

Begrippen CBS
type: ConceptScheme
preferred label: Concepts Statistics Netherlands @en