Arbeid en sociale zekerheid
type: Concept
narrower: Werkbelasting

CBS begrip
label: CBS concept @en

Werkbelasting
type: Concept
type: CBS begrip
created: 2016-03-23T09:08:51Z
modified: 2022-02-23T15:56:23Z
source: werkbelasting
version info: 1
broader: Arbeid en sociale zekerheid
definition: Van werkbelasting is sprake bij een persoon die 'ja, regelmatig' of 'ja, meestal' antwoordt op de desbetreffende enquêtevraag naar lichamelijke en psychische werkbelasting.
definition: People who answer the question in the survey on physical or mental burden caused by their work with “yes, regularly” or “yes, usually”. @en
in scheme: Begrippen CBS
preferred label: Stress caused by work @en

Begrippen CBS
type: ConceptScheme
preferred label: Concepts Statistics Netherlands @en