Vrije tijd en cultuur
type: Concept
narrower: Statisch archief

CBS begrip
label: CBS concept @en

Statisch archief
type: Concept
type: CBS begrip
created: 2016-03-23T09:11:25Z
modified: 2022-02-23T15:55:35Z
source: statisch-archief
version info: 1
broader: Vrije tijd en cultuur
definition: Het deel van het archief dat betrekking heeft op de archiefbescheiden, die volgens de Archiefwet 1995 bewaard moeten worden. Tegenwoordig betreft dat in principe overheidsstukken ouder dan 20 jaar.
definition: Part of the archive that applies to records in the archive that must be preserved under the law on archives of 1995. In principle this applies to government documents over 20 years old. @en
in scheme: Begrippen CBS
preferred label: Static archive @en

Begrippen CBS
type: ConceptScheme
preferred label: Concepts Statistics Netherlands @en