Bouwen en wonen
type: Concept
narrower: Bouwvergunning

CBS begrip
label: CBS concept @en

Bouwvergunning
type: Concept
type: CBS begrip
created: 2016-03-23T09:07:49Z
modified: 2022-02-23T15:52:53Z
source: bouwvergunning
version info: 1
broader: Bouwen en wonen
definition: Vergunning, ingevolge de woningwet nodig voor het bouwen of verbouwen van een gebouw.
definition: Permission granted to build or renovate a building as required by the law on housing. @en
in scheme: Begrippen CBS
preferred label: Building permission @en
scope note: In de Woningwet is vastgelegd voor welke bouwwerken (ook 'niet voor bewoning bestemde gebouwen' of 'bouwwerken geen gebouw zijnde' zoals bruggen etc) een vergunning is vereist. De vergunning wordt afgegeven door de gemeente, die eerst toetst of het bouwplan voldoet aan: het bestemmingsplan; het Bouwbesluit; de lokale Bouwverordening, en de redelijke eisen van welstand. In Nederland is de bouwvergunning per 1 oktober 2010 vervangen door een meeromvattende omgevingsvergunning. Een vergunning kan voor één of meer gebouwen tegelijk afgegeven worden.

Begrippen CBS
type: ConceptScheme
preferred label: Concepts Statistics Netherlands @en