Vrije tijd en cultuur
type: Concept
narrower: Hotel

CBS begrip
label: CBS concept @en

Gast
type: Concept
type: CBS begrip
preferred label: Guest @en
related: Hotel

Hotel
type: Concept
type: CBS begrip
created: 2016-03-23T09:10:54Z
modified: 2022-02-23T15:53:50Z
source: hotel
version info: 1
broader: Vrije tijd en cultuur
definition: Een accommodatie met slaapplaatsen voor logiesverstrekking in overwegend een- en tweepersoonskamers tegen boeking per nacht, waar afzonderlijke maaltijden, kleine etenswaren en dranken kunnen worden verstrekt aan gasten en aan passanten. Ook appartementen met hoteldienstverlening behoren hiertoe.
definition: Accommodation providing beds mostly in 1 and 2-bed rooms available for reservation per night, which may also provide separate meals, food and drink to guests and to non-guests. Also included are apartments with hotel service. @en
in scheme: Begrippen CBS
related: Gast
related: Passant
related: Pension
scope note: Een principieel verschil tussen een hotel en een pension is dat een hotel wel consumpties verstrekt aan passanten en een pension niet.

Passant
type: Concept
type: CBS begrip
preferred label: Transient @en
related: Hotel

Pension
type: Concept
type: CBS begrip
preferred label: Boarding house @en
related: Hotel

Begrippen CBS
type: ConceptScheme
preferred label: Concepts Statistics Netherlands @en