Inkomen en bestedingen
type: Concept
narrower: Voornaamste inkomensbron

CBS begrip
label: CBS concept @en

Voornaamste inkomensbron
type: Concept
type: CBS begrip
created: 2016-03-23T09:04:37Z
modified: 2022-02-23T15:56:15Z
source: voornaamste-inkomensbron
version info: 1
broader: Inkomen en bestedingen
definition: Indeling van huishoudens naar het inkomensbestanddeel met het hoogste bedrag, waarin de inkomensbestanddelen van alle leden van het huishouden worden samengeteld.
definition: Categorisation of households by the highest amount of income. Income from all household members is added up by source. @en
in scheme: Begrippen CBS
preferred label: Main source of income @en
scope note: De navolgende inkomensbestanddelen worden onderscheiden: 1 Inkomen uit arbeid 1.1 Loon werknemer 1.2 Loon ambtenaar 1.3 Overig inkomen uit arbeid 2 Inkomen uit eigen onderneming 3 Inkomen uit vermogen 4 Overdrachtsinkomen 4.1 Uitkering inkomensverzekering 4.1.1 Uitkering ivm werkloosheid 4.1.2 Uitkering ivm ziekte en arbeidsongeschiktheid 4.1.3 Uitkering ivm ouderdom en nabestaanden 4.2 Uitkering sociale voorziening 4.2.1 Uitkering algemene bijstandswet 4.2.2 Sociale voorzieningen, overig 4.3 Overig overdrachtsinkomen Het hoogste bedrag van deze inkomensbestanddelen bepaalt de voornaamste inkomensbron, waarbij eerst de totalen per hoofdgroepering onderling worden vergeleken. Indien sprake is van inkomen uit eigen onderneming is dit bestanddeel steeds als voornaamste inkomensbron aangemerkt, ook al is er sprake van een gering of zelfs negatief inkomen. In publicatietabellen wordt de categorie inkomen uit vermogen steeds samengevoegd met inkomen uit eigen onderneming.

Begrippen CBS
type: ConceptScheme
preferred label: Concepts Statistics Netherlands @en