Onderwijs
type: Concept
narrower: Standaard Onderwijsindeling 1978

CBS begrip
label: CBS concept @en

Standaard Onderwijsindeling 1978
type: Concept
type: CBS begrip
created: 2016-03-23T09:05:39Z
modified: 2022-02-23T15:55:34Z
source: standaard-onderwijsindeling-1978--soi-1978--
subject: https://taxonomie.cbs.nl/vocab/id/2500
version info: 1
alternative label: SOI 1978
broader: Onderwijs
definition: De door het CBS vanaf 1978 gehanteerde indeling van opleidingen naar niveau en naar richting, ontwikkeld voor gebruik bij statistiek en onderzoek en voor administratieve doeleinden in Nederland.
definition: The classification of educational programs by level and field used by Statistics Netherlands since 1978 developed for use in statistics and research and for administrative purposes in the Netherlands. @en
in scheme: Begrippen CBS
preferred label: Dutch Standard Classification of Education (SOI) 1978 @en
scope note: De SOI 1978-code bestaat uit vijf cijfers die zo gedetailleerd mogelijk niveau en richting van een opleiding beschrijven. Het eerste cijfer geeft het niveau van een opleiding aan. Uit de volgende vier cijfers kan de richting van een opleiding worden afgeleid: sector, subsector, rubrieksgroep, rubriek. De SOI 1978 is ontwikkeld met als doel een Nederlandse standaardindeling van opleidingen te vervaardigen, die lange tijd gebruikt kan worden en die zo goed mogelijk aansluit bij de door de UNESCO aanbevolen ISCED. Onderwijs is in het verleden voornamelijk als persoonskenmerk beschouwd. Dit blijkt onder meer uit het gebruik bij de volkstellingen. De ISCED en in navolging daarvan de SOI 1978 heeft voor het opstellen van de classificatie afgezien van de persoon en in plaats daarvan de opleiding als object van de classificatie genomen.

Begrippen CBS
type: ConceptScheme
preferred label: Concepts Statistics Netherlands @en