Arbeid en sociale zekerheid
type: Concept
narrower: Bijzondere bijstand

CBS begrip
label: CBS concept @en

Bijzondere bijstand
type: Concept
type: CBS begrip
created: 2016-03-23T09:09:53Z
modified: 2022-02-23T15:52:47Z
source: bijzondere-bijstand
version info: 1
broader: Arbeid en sociale zekerheid
definition: Bijstand die alleen wordt verstrekt als iemand in bijzondere omstandigheden verkeert en daardoor hogere kosten heeft dan de kosten waarin de algemene bijstandsuitkering voorziet.
definition: Income support provided under special circumstances only, when the welfare recipient incurs higher costs than the normal benefits provide for. @en
in scheme: Begrippen CBS
preferred label: Special income support @en
scope note: Het betreft alle bijstand die wordt verstrekt boven op de algemene bijstandsuitkering (basisnorm plus toeslagen) óf boven op een ander inkomen of uitkering (arbeid, AOW, WAZ, Wajong, etc.).

Begrippen CBS
type: ConceptScheme
preferred label: Concepts Statistics Netherlands @en