Bedrijven
type: Concept
narrower: Exploitatieoverschot

CBS begrip
label: CBS concept @en

Exploitatieoverschot
type: Concept
type: CBS begrip
created: 2016-03-23T09:04:19Z
modified: 2023-03-29T15:52:14Z
source: exploitatieoverschot
version info: 2
broader: Bedrijven
definition: Value added after subtraction of employees' remuneration and net payments of /revenues from product-related taks and subsidies, e.g. property taks and motor vehicle taks. @en
definition: Het saldo dat resteert nadat de toegevoegde waarde tegen basisprijzen is verminderd met de beloning van werknemers en het saldo van belastingen en subsidies op productie en invoer.
history note: De definitie is aangepast
in scheme: Begrippen CBS
note: Vorige definitie: De toegevoegde waarde na aftrek van de beloning van werknemers en het saldo van overige belastingen en subsidies op productie, zoals onroerendezaakbelasting (ozb) en motorrijtuigenbelasting.
preferred label: Operating surplus @en
scope note: Bij vennootschappen kan het worden opgevat als beloning voor de inzet van kapitaal. Bij zelfstandigen bevat het daarnaast een beloning voor de inzet van arbeid door zelfstandigen en hun meewerkende gezinsleden.

Begrippen CBS
type: ConceptScheme
preferred label: Concepts Statistics Netherlands @en