Bedrijven
type: Concept
narrower: Omzet binnenland

CBS begrip
label: CBS concept @en

Omzet binnenland
type: Concept
type: CBS begrip
created: 2016-03-23T09:19:00Z
modified: 2022-02-23T15:54:37Z
source: omzet-binnenland
version info: 1
broader: Bedrijven
definition: De totale omzet uit de hoofdactiviteit aan binnenlandse afnemers.
definition: Total net turnover from sales to domestic buyers @en
in scheme: Begrippen CBS
preferred label: Domestic net turnover @en

Begrippen CBS
type: ConceptScheme
preferred label: Concepts Statistics Netherlands @en