Verkeer en vervoer
type: Concept
narrower: Duwvaart

CBS begrip
label: CBS concept @en

Duwvaart
type: Concept
type: CBS begrip
created: 2016-03-23T09:12:12Z
modified: 2022-02-23T15:53:18Z
source: duwvaart
version info: 1
broader: Verkeer en vervoer
definition: Vaart waarbij een of meer laadbakken (zonder eigen beweegkracht) worden voortgeduwd door een duwboot, centraal bestuurd.
definition: Shipping where one or more dumb barges are pushed by a centrally steered push boat. @en
in scheme: Begrippen CBS
preferred label: Push-towing @en

Begrippen CBS
type: ConceptScheme
preferred label: Concepts Statistics Netherlands @en