Bedrijven
type: Concept
narrower: Materiële vaste activa

CBS begrip
label: CBS concept @en

Materiële vaste activa
type: Concept
type: CBS begrip
created: 2016-03-23T09:13:53Z
modified: 2022-02-23T15:54:20Z
source: materiele-vaste-activa
version info: 1
broader: Bedrijven
definition: Vaste activa die betrekking hebben op tastbare kapitaalgoederen.
definition: Fixed assets that can be seen, touched or physically measured. @en
in scheme: Begrippen CBS
preferred label: Tangible fixed assets @en
scope note: Voorbeelden van materiële vaste activa zijn: grond, woningen en bedrijfsgebouwen, weg- en waterbouwkundige werken, vervoermiddelen, machines, installaties en apparatuur, in cultuur gebrachte flora en fauna (bomen, vee).

Begrippen CBS
type: ConceptScheme
preferred label: Concepts Statistics Netherlands @en