Arbeid en sociale zekerheid
type: Concept
narrower: Loon(kosten)subsidie

CBS begrip
label: CBS concept @en

Loon(kosten)subsidie
type: Concept
type: CBS begrip
created: 2016-03-23T09:04:50Z
modified: 2022-02-23T15:54:17Z
source: loon-kosten--subsidie
version info: 1
broader: Arbeid en sociale zekerheid
definition: Subsidie op de totale loonsom of het aantal werknemers, dan wel op het in dienst hebben van bepaalde categorieën personen, zoals lichamelijk gehandicapten of langdurig werklozen. Ook subsidies op de kosten van opleidingsprogramma's die door ondernemingen worden georganiseerd behoren hiertoe.
definition: Subsidy on the total wage sum or the number of employees. Or subsidies for employing certain categories of people, such as physically disabled or long-term unemployed people. Also subsidies on the cost of training organised by enterprises. @en
in scheme: Begrippen CBS
preferred label: Wage cost subsidies @en

Begrippen CBS
type: ConceptScheme
preferred label: Concepts Statistics Netherlands @en