Bedrijven
type: Concept
narrower: Nomenclature générale des Activités économiques dans la Communauté Européenne

CBS begrip
label: CBS concept @en

Standaard Bedrijfsindeling 1993
type: Concept
type: CBS begrip
preferred label: Dutch Standard industrial classification (SBI) 1993 @en
related: Nomenclature générale des Activités économiques dans la Communauté Européenne

Nomenclature générale des Activités économiques dans la Communauté Européenne
type: Concept
type: CBS begrip
created: 2016-03-23T09:04:58Z
modified: 2022-02-23T15:54:35Z
source: nomenclature-generale-des-activites-economiques-dans-la-communaute-europeenne--nace--
version info: 1
alternative label: NACE
broader: Bedrijven
definition: De in de EU geldende classificatie van economische activiteiten.
definition: The classification used in the EU for economic activities @en
in scheme: Begrippen CBS
preferred label: General Industrial Classification of Economic Activities within the European Community @en
related: Standaard Bedrijfsindeling 1993
related: Standaard Bedrijfsindeling 2008 (SBI 2008)
scope note: Bij EU-verordening nr. 3037/90 van 9/10/1990 werden alle lidstaten verplicht om met ingang van 1993 hun nationale classificaties van economische activiteit in overeenstemming te brengen met NACE. Per 1 januari 2008 is versie NACE Rev. 2 van toepassing. De door het CBS gehanteerde Standaard Bedrijfsindeling 2008 (SBI 2008) is tot en met het niveau van de klassen (vier cijfers), op een aantal uitzonderingen na, gelijk aan de NACE Rev. 2. Op het niveau van de afdeling, aangegeven door twee cijfers, stemmen SBI 2008 en NACE Rev. 2 overeen met de ISIC Rev. 4, de door de Verenigde Naties aanbevolen classificatie van economische activiteiten.

Standaard Bedrijfsindeling 2008 (SBI 2008)
type: Concept
type: CBS begrip
preferred label: Dutch Standard industrial classification (SBI 2008) @en
related: Nomenclature générale des Activités économiques dans la Communauté Européenne

Begrippen CBS
type: ConceptScheme
preferred label: Concepts Statistics Netherlands @en