Arbeid en sociale zekerheid
type: Concept
narrower: Woon-werkverkeer

CBS begrip
label: CBS concept @en

Woon-werkverkeer
type: Concept
type: CBS begrip
created: 2016-03-23T09:06:18Z
modified: 2022-02-23T15:56:31Z
source: woon-werkverkeer
version info: 1
alternative label: Forensisme
broader: Arbeid en sociale zekerheid
definition: Heen en weer reizen tussen de woon- of verblijfsplaats en de plaats waar arbeid wordt verricht.
in scheme: Begrippen CBS
preferred label: Commuter traffic @en

Begrippen CBS
type: ConceptScheme
preferred label: Concepts Statistics Netherlands @en