Arbeid en sociale zekerheid
type: Concept
narrower: Werkstaking

CBS begrip
label: CBS concept @en

Werkstaking
type: Concept
type: CBS begrip
created: 2016-03-23T09:06:15Z
modified: 2022-02-23T15:56:25Z
source: werkstaking
version info: 1
broader: Arbeid en sociale zekerheid
definition: Het tijdelijke stopzetten van de werkzaamheden door werknemers om tegemoetkoming aan gestelde eisen af te dwingen.
definition: Temporary interruption of work by employees in order to enforce their claims. @en
in scheme: Begrippen CBS
preferred label: Strike @en

Begrippen CBS
type: ConceptScheme
preferred label: Concepts Statistics Netherlands @en