Bedrijven
type: Concept
narrower: Inkoopwaarde handelsgoederen

CBS begrip
label: CBS concept @en

Inkoopwaarde handelsgoederen
type: Concept
type: CBS begrip
created: 2016-03-23T09:19:01Z
modified: 2022-02-23T15:53:57Z
source: inkoopwaarde-handelsgoederen
version info: 1
broader: Bedrijven
definition: Handelsgoederen zijn goederen die zijn ingekocht met de bedoeling deze zonder verdere bewerking door te verkopen.
definition: Costs of commodities sold in the year under review. @en
in scheme: Begrippen CBS
preferred label: Costs of commodities @en
scope note: Deze post omvat ook de invoerrechten, de kosten van inklaring, invoerheffingen van de Europese Unie, de kosten van tijdelijke voorraadopslag, de kosten voor transport en voor transportverzekering van de inkopen. De inkoopwaarde vormt het totaal van de waarde van de beginvoorraad plus de kosten van de inkopen minus de waarde van de eindvoorraad.

Begrippen CBS
type: ConceptScheme
preferred label: Concepts Statistics Netherlands @en