Bedrijven
type: Concept
narrower: Vestiging (economische statistiek)

CBS begrip
label: CBS concept @en

Onderneming
type: Concept
type: CBS begrip
preferred label: Enterprise group @en
related: Vestiging (economische statistiek)

Vestiging (economische statistiek)
type: Concept
type: CBS begrip
created: 2016-03-23T09:07:25Z
modified: 2022-02-23T15:56:09Z
source: vestiging--economische-statistiek--
version info: 1
broader: Bedrijven
definition: Elke afzonderlijk gelegen ruimte, terrein of complex van ruimten of terreinen, benut door een onderneming voor de uitoefening van de activiteiten. Iedere onderneming bestaat uit tenminste één vestiging.
definition: Each individual space, area or complex of buildings or areas used by an enterprise for its activities. Each enterprise has at least one location. @en
in scheme: Begrippen CBS
preferred label: Location @en
related: Onderneming
related: Lokale bedrijfseenheid

Lokale bedrijfseenheid
type: Concept
type: CBS begrip
preferred label: Local part of an enterprise @en
related: Vestiging (economische statistiek)

Begrippen CBS
type: ConceptScheme
preferred label: Concepts Statistics Netherlands @en