Onderwijs
type: Concept
narrower: Voorbereidend middelbaar beroepsonderwijs

CBS begrip
label: CBS concept @en

Voortgezet onderwijs
type: Concept
type: CBS begrip
preferred label: Secondary education (VO) @en
related: Voorbereidend middelbaar beroepsonderwijs

Voortgezet algemeen volwassenenonderwijs
type: Concept
type: CBS begrip
preferred label: Adult general secondary education @en
related: Voorbereidend middelbaar beroepsonderwijs

Voorbereidend middelbaar beroepsonderwijs
type: Concept
type: CBS begrip
created: 2016-03-23T09:10:46Z
modified: 2022-02-23T15:56:14Z
source: voorbereidend-middelbaar-beroepsonderwijs--vmbo--
version info: 1
alternative label: Vmbo
broader: Onderwijs
definition: Voortzetting m.i.v. augustus 1999 van het mavo en vbo. Het bereidt voor op het middelbaar beroepsonderwijs, heeft een duur van vier jaar en kent vier onderwijsprogramma’s, leerwegen genoemd, die een voorgeschreven aantal vakken en relatief vaststaand eindexamenpakket hebben: de theoretische leerweg, de gemengde leerweg, de kaderberoepsgerichte leerweg en de basisberoepsgerichte leerweg.
definition: Prevocational training preparing for vocational training at the secondary level. It is a four-year course with four tracks, each with a fixed curriculum and set final exams: VMBO theoretical programme, VMBO combined theoretical and vocational programme, V @en
in scheme: Begrippen CBS
preferred label: Prevocational secondary education @en
related: Voortgezet algemeen volwassenenonderwijs
related: Voortgezet onderwijs
scope note: De theoretische leerweg is te beschouwen als de opvolger van de mavo en geeft toegang tot de middenkaderopleiding, niveau 4 van de kwalificatiestructuur van het mbo. Het is na diplomering tevens mogelijk door te stromen naar het vierde leerjaar havo. De gemengde leerweg is te beschouwen als een tussenvorm van de theoretische leerweg en de beroepsgerichte leerwegen, heeft hetzelfde niveau als de theoretische leerweg, maar heeft ook een beroepsgericht vak. De gemengde leerweg geeft toegang tot de middenkaderopleiding, niveau 4 van de kwalificatiestructuur van het mbo. De kaderberoepsgerichte leerweg is te beschouwen als de opvolger van de hoogste niveaus van het vbo en is de minimale vooropleiding voor de vakopleiding en de middenkaderopleiding, resp. op niveau 3 en 4 van de kwalificatiestructuur van het mbo. De basisberoepsgerichte leerweg is te beschouwen als de opvolger van de laagste niveaus van het vbo en is bedoeld als vooropleiding voor de basisberoepsopleiding, niveau 2 van de kwalificatiestructuur van het mbo. Voor bepaalde probleemcategorieën vmbo-leerlingen is het leerwegondersteunend onderwijs ingesteld, waarin dezelfde leerwegen kunnen worden gevolgd en dezelfde diploma's kunnen worden gehaald als in het normale vmbo-onderwijs. Zie daarvoor de definitie van het lwoo.

Begrippen CBS
type: ConceptScheme
preferred label: Concepts Statistics Netherlands @en