Diensten
type: Concept
narrower: Banken

CBS begrip
label: CBS concept @en

Banken
type: Concept
type: CBS begrip
created: 2016-03-23T09:03:50Z
modified: 2022-06-14T08:34:36Z
source: banken
subject: https://taxonomie.cbs.nl/vocab/id/517
version info: 1
broader: Diensten
definition: Geldscheppende instellingen en ondernemingen die als hoofdtaak het verlenen van financiële diensten hebben.
in scheme: Begrippen CBS
preferred label: Banks @en

Begrippen CBS
type: ConceptScheme
preferred label: Concepts Statistics Netherlands @en