Verkeer en vervoer
type: Concept
narrower: Verkeersdeelnemer

CBS begrip
label: CBS concept @en

Verkeersdeelnemer
type: Concept
type: CBS begrip
created: 2016-03-23T09:08:01Z
modified: 2022-02-23T15:56:01Z
source: verkeersdeelnemer
version info: 1
broader: Verkeer en vervoer
definition: Deelnemer aan het verkeer op de openbare weg, als voetganger of als gebruiker (bestuurder of passagier) van een vervoermiddel.
definition: Someone who participates in traffic as a pedestrian or as the user of a means of transport (driver or passenger). @en
in scheme: Begrippen CBS
preferred label: Participant in traffic @en

Begrippen CBS
type: ConceptScheme
preferred label: Concepts Statistics Netherlands @en