Bevolking
type: Concept
narrower: Bevolking

CBS begrip
label: CBS concept @en

Inwoner
type: Concept
type: CBS begrip
preferred label: Inhabitant @en
related: Bevolking

Bevolking
type: Concept
type: CBS begrip
created: 2016-03-23T09:03:59Z
modified: 2022-02-23T15:52:45Z
source: bevolking
version info: 1
broader: Bevolking
definition: De bewoners van een bepaald gebied.
definition: The total number of people residing in a given area. @en
in scheme: Begrippen CBS
preferred label: Population @en
related: Inwoner
scope note: In de CBS-bevolkingsaantallen zijn uitsluitend personen begrepen die zijn opgenomen in het bevolkingsregister van een Nederlandse gemeente. In principe wordt iedereen die voor onbepaalde tijd in Nederland woont, opgenomen in het bevolkingsregister van de woongemeente. Personen die tot de bevolking van Nederland behoren, maar voor wie geen vaste woonplaats valt aan te wijzen, zijn opgenomen in het bevolkingsregister van de gemeente 's-Gravenhage. In de bevolkingsregisters zijn niet opgenomen de in Nederland wonende personen waarvoor uitzonderingsregels gelden met betrekking tot opneming in de bevolkingsregisters (bijvoorbeeld diplomaten en NAVO militairen) en personen die niet legaal in Nederland verblijven.

Begrippen CBS
type: ConceptScheme
preferred label: Concepts Statistics Netherlands @en