Bedrijven
type: Concept
narrower: Resultaat voor belastingen

CBS begrip
label: CBS concept @en

Resultaat voor belastingen
type: Concept
type: CBS begrip
created: 2016-03-23T09:19:13Z
modified: 2022-02-23T15:55:14Z
source: resultaat-voor-belastingen
version info: 1
broader: Bedrijven
definition: The sum of the operating and financial results. @en
definition: De som van het bedrijfsresultaat, het financiële resultaat, het saldo voorzieningen en het buitengewoon resultaat. .
in scheme: Begrippen CBS
preferred label: Pre-tax results @en
scope note: Vanaf 2006 bij de Productiestatistieken: De som van het bedrijfsresultaat en de financiële resultaten

Begrippen CBS
type: ConceptScheme
preferred label: Concepts Statistics Netherlands @en