Arbeid en sociale zekerheid
type: Concept
narrower: Overhevelingstoeslag

CBS begrip
label: CBS concept @en

Overhevelingstoeslag
type: Concept
type: CBS begrip
created: 2016-03-23T09:09:50Z
modified: 2022-02-23T15:54:49Z
source: overhevelingstoeslag
version info: 1
broader: Arbeid en sociale zekerheid
definition: Een toeslag op het salaris en/of uitkering die door de werkgever of uitkerende instantie betaald wordt als compensatie voor de werknemers en/of uitkeringsgerechtigden te betalen sociale premies.
definition: A premium from the salary/ benefits paid by the employer or social security institution as a compensation for social security premiums paid by the employees or recipients of benefits. @en
in scheme: Begrippen CBS
preferred label: Premium transfer @en

Begrippen CBS
type: ConceptScheme
preferred label: Concepts Statistics Netherlands @en