Arbeid en sociale zekerheid
type: Concept
narrower: Arbeidskosten

CBS begrip
label: CBS concept @en

Arbeidskosten
type: Concept
type: CBS begrip
created: 2016-03-23T09:09:03Z
modified: 2023-08-17T12:41:48
source: arbeidskosten
version info: 2
alternative label: personeelskosten
broader: Arbeid en sociale zekerheid
definition: All costs connected with employing workers. These include compensation of employees, training costs and a number of other costs. The compensation of employees consists of two components: wages and social premiums paid by the employer. Subsidies are subtracted from the labour costs. @en
definition: Alle kosten die samenhangen met het in dienst hebben van personeel door werkgevers.
history note: De definitie is aangepast
in scheme: Begrippen CBS
note: Vorige definitie: Arbeidskosten zijn alle kosten die samenhangen met het in dienst hebben van personeel door werkgevers.
preferred label: Labour costs (in the labour cost survey) @en
scope note: Naast loonkosten maken bedrijven en instellingen ook kosten die niet direct aan de individuele werknemers kunnen worden toegerekend, zoals kosten voor scholing, de exploitatie van kantines en de werving en selectie van personeel. De arbeidskosten zijn gelijk aan de loonkosten vermeerderd met deze overige arbeidskosten.

Begrippen CBS
type: ConceptScheme
preferred label: Concepts Statistics Netherlands @en