Onderwijs
type: Concept
narrower: Bachelordiploma

CBS begrip
label: CBS concept @en

Masterdiploma
type: Concept
type: CBS begrip
related: Bachelordiploma

Beroepsdiploma
type: Concept
type: CBS begrip
related: Bachelordiploma

Bachelordiploma
type: Concept
type: CBS begrip
created: 2016-03-23T09:14:28Z
modified: 2022-02-23T15:52:32Z
source: bachelordiploma
version info: 1
broader: Onderwijs
definition: Diploma van een wettelijk erkende bacheloropleiding in het hoger beroepsonderwijs (hbo) of wetenschappelijk onderwijs (wo) na invoering van het bachelor-masterstelsel.
in scheme: Begrippen CBS
related: Beroepsdiploma
related: Doctoraaldiploma
related: Masterdiploma
scope note: Met ingang van het studiejaar 2002/’03 is in het hoger onderwijs het bachelor-masterstelsel ingevoerd. Als gevolg daarvan zijn de meeste reguliere hbo-opleidingen omgezet in bacheloropleidingen van 4 jaar. Bij een beperkt aantal studies is daar een masteropleiding aan toegevoegd. Bij de invoering van het bachelor-masterstelsel zijn de wetenschappelijke opleidingen van meet af aan opgedeeld in een bacheloropleiding van 3 jaar en een daarop aansluitende masteropleiding van 1, 2 of 3 jaar. Zowel de bachelor- als masteropleiding worden afgesloten met een diploma. Een bachelordiploma geeft toegang tot een masteropleiding in het hbo of wo. De bacheloropleidingen van het hbo en wo zijn in de praktijk niet gelijkwaardig. Voor toelating tot een masteropleiding aan de universiteit moet een gediplomeerde hbo’er vrijwel altijd eerst een schakelprogramma volgen. Het niveau van het bachelordiploma in het wo is gelijk aan dat van het diploma van het vroegere kandidaatsexamen. De wettelijk erkende opleidingen voor een bachelor- of masterdiploma zijn opgenomen in het Centraal Register Opleidingen Hoger Onderwijs (CROHO). In het hoger beroepsonderwijs mogen zowel de geslaagden van vóór als na de invoering van het bachelor-masterstelsel de titel bachelor gebruiken.

Doctoraaldiploma
type: Concept
type: CBS begrip
preferred label: Master's degree @en
related: Bachelordiploma

Begrippen CBS
type: ConceptScheme
preferred label: Concepts Statistics Netherlands @en