Arbeid en sociale zekerheid
type: Concept
narrower: Samenloop bij uitkeringen

CBS begrip
label: CBS concept @en

Samenloop bij uitkeringen
type: Concept
type: CBS begrip
created: 2016-03-23T09:06:38Z
modified: 2022-02-23T15:55:18Z
source: samenloop-bij-uitkeringen
version info: 1
broader: Arbeid en sociale zekerheid
definition: Situatie waarbij een persoon tegelijkertijd verschillende uitkeringen ontvangt, bijvoorbeeld een arbeidsongeschiktheidsuitkering en een bijstandsuitkering.
definition: Situation in which someone receives different benefits, for instance welfare and a disablement benefits. @en
in scheme: Begrippen CBS
preferred label: Concomitant benefits @en
scope note: De som van de personen met een bijstandsuitkering, personen met een arbeidsongeschiktheidsuitkering en personen met een WW-uitkering is door samenloop groter dan het totaal aantal personen met een uitkering. Voorbeelden van samenloop bij uitkeringen: een arbeidsongeschiktheidsuitkering en een bijstandsuitkering of twee WW-uitkeringen.

Begrippen CBS
type: ConceptScheme
preferred label: Concepts Statistics Netherlands @en