Bedrijven
type: Concept
narrower: Bedrijfsopbrengsten

CBS begrip
label: CBS concept @en

Overige bedrijfsopbrengsten
type: Concept
type: CBS begrip
preferred label: Other revenues @en
related: Bedrijfsopbrengsten

Bedrijfsresultaat
type: Concept
type: CBS begrip
preferred label: Operating results @en
related: Bedrijfsopbrengsten

Bedrijfskosten
type: Concept
type: CBS begrip
preferred label: Operating costs @en
related: Bedrijfsopbrengsten

Bedrijfsopbrengsten
type: Concept
type: CBS begrip
created: 2016-03-23T09:09:01Z
modified: 2022-02-23T15:52:36Z
source: bedrijfsopbrengsten
version info: 1
broader: Bedrijven
definition: De opbrengsten uit de eigenlijke bedrijfsvoering, i.c. de verkopen van goederen en diensten, alsmede de waarde van voorraadmutaties, geactiveerde productie voor het eigen bedrijf, subsidies en schade-uitkeringen.
definition: The results from normal business activities, this is the sales of goods and services, the value of stock changes, the activated production for the company, subsidies and damage claims. @en
in scheme: Begrippen CBS
preferred label: Operating returns @en
related: Bedrijfsresultaat
related: Overige bedrijfsopbrengsten
related: Bedrijfskosten

Begrippen CBS
type: ConceptScheme
preferred label: Concepts Statistics Netherlands @en