Internationale handel
type: Concept
narrower: Transactie (handel)

CBS begrip
label: CBS concept @en

Transactie (handel)
type: Concept
type: CBS begrip
created: 2016-03-23T09:09:47Z
modified: 2022-02-23T15:55:48Z
source: transactie--handel--
version info: 1
broader: Internationale handel
definition: De aard van de overeenkomst die aan de levering van de goederen ten grondslag ligt.
definition: The type of agreement on which the delivery of goods is based. For instance: purchase/sale, return shipment. @en
in scheme: Begrippen CBS
preferred label: Transaction (trade) @en
scope note: Voorbeelden van transacties zijn: koop/verkoop, retourzending, transactie zonder verrekening, loonveredeling en reparatie.

Begrippen CBS
type: ConceptScheme
preferred label: Concepts Statistics Netherlands @en