Arbeid en sociale zekerheid
type: Concept
narrower: Ziekteverzuimpercentage VJG (rijksoverheid)

CBS begrip
label: CBS concept @en

Ziekteverzuimpercentage VJG (rijksoverheid)
type: Concept
type: CBS begrip
created: 2016-03-23T09:08:15Z
modified: 2022-02-23T15:56:34Z
source: ziekteverzuimpercentage-vjg--rijksoverheid--
version info: 1
broader: Arbeid en sociale zekerheid
definition: het ziekteverzuim overheid, inclusief verzuim langer dan een jaar en exclusief zwangerschaps- en bevallingsverlof. (Hierbij een verwijzing naar het begrip ziekteverzuim overheid).
definition: Shifting year average of the percentage of sick leave in the public sector. It refers to sick leave including leave of more than one year and excluding pregnancy and maternity leave. It indicates long term developments. @en
in scheme: Begrippen CBS
preferred label: Sick leave (government) @en
scope note: Voortschrijdende jaargemiddelden worden elk kwartaal opnieuw berekend door aan de verslagperiode een nieuw kwartaal toe te voegen en het oudste kwartaal weg te laten. Hierdoor worden de seizoensinvloeden grotendeels uitgeschakeld. Het voortschrijdend jaargemiddelde van het ziekteverzuimpercentage is aangegeven bij het laatste kwartaal in de periode.

Begrippen CBS
type: ConceptScheme
preferred label: Concepts Statistics Netherlands @en