Industrie en energie
type: Concept
narrower: Houtskool

CBS begrip
label: CBS concept @en

Houtskool
type: Concept
type: CBS begrip
created: 2016-03-23T09:18:39Z
modified: 2022-02-23T15:53:50Z
source: houtskool
version info: 1
broader: Industrie en energie
definition: Het vaste residu dat overblijft na verbranding bij lage temperatuur van hout en ander plantaardig materiaal.
definition: Solid residue derived through combustion at low temperature of wood and other vegetable material. @en
in scheme: Begrippen CBS
preferred label: Charcoal @en

Begrippen CBS
type: ConceptScheme
preferred label: Concepts Statistics Netherlands @en