Verkeer en vervoer
type: Concept
narrower: Wegvoertuig

CBS begrip
label: CBS concept @en

Wegvoertuig
type: Concept
type: CBS begrip
created: 2016-03-23T09:19:38Z
modified: 2022-02-23T15:56:22Z
source: wegvoertuig
version info: 1
broader: Verkeer en vervoer
definition: Voertuig op wielen bestemd voor gebruik op wegen.
definition: Vehicle running on wheels and intended for use on roads. @en
in scheme: Begrippen CBS
preferred label: Road vehicle @en
scope note: Hieronder vallen personenauto's, bedrijfsvoertuigen (bestelauto's, vrachtauto's, trekkers, speciale voertuigen, bussen, aanhangwagens en opleggers), motorfietsen en voertuigen met een bromfietskenteken. Met ingang van september 2003 dienen aanhangwagens en opleggers te zijn voorzien van een geldig kenteken. Vanaf 2004 zijn deze categorieën opgenomen in de overzichten van de statistiek motorvoertuigen.

Begrippen CBS
type: ConceptScheme
preferred label: Concepts Statistics Netherlands @en