Macro-economie
type: Concept
narrower: Consumptie huishoudens nationaal

CBS begrip
label: CBS concept @en

Huishouden
type: Concept
type: CBS begrip
preferred label: Household @en
related: Consumptie huishoudens nationaal

Ingezetene
type: Concept
type: CBS begrip
preferred label: Resident @en
related: Consumptie huishoudens nationaal

Consumptie huishoudens nationaal
type: Concept
type: CBS begrip
created: 2016-03-23T09:10:05Z
modified: 2022-02-23T15:53:06Z
source: consumptie-huishoudens-nationaal
version info: 1
broader: Macro-economie
definition: Uitgaven door ingezeten huishoudens voor goederen en diensten die worden gebruikt voor de rechtstreekse bevrediging van individuele of collectieve behoeften van leden van de gemeenschap. De uitgaven kunnen zowel op het eigen grondgebied als in het buitenland worden gedaan.
definition: Expenditure by resident households on goods and services for the direct satisfaction of individual or collective needs of members of society. @en
in scheme: Begrippen CBS
preferred label: Consumption by households, national @en
related: Ingezetene
related: Huishouden
related: Consumptieve bestedingen

Consumptieve bestedingen
type: Concept
type: CBS begrip
preferred label: Consumption expenditure @en
related: Consumptie huishoudens nationaal

Begrippen CBS
type: ConceptScheme
preferred label: Concepts Statistics Netherlands @en