Bevolking
type: Concept
narrower: Binnenlandse verhuizing

CBS begrip
label: CBS concept @en

Binnenlandse verhuizing
type: Concept
type: CBS begrip
created: 2016-03-23T09:07:01Z
modified: 2022-02-23T15:52:49Z
source: binnenlandse-verhuizing
version info: 1
broader: Bevolking
definition: Elke verhuizing binnen Nederland.
definition: Each move within the Netherlands. @en
in scheme: Begrippen CBS
preferred label: Move within the Netherlands @en
scope note: In de CBS-bevolkingsstatistieken zijn uitsluitend die verhuizingen opgenomen die door de burger zijn gemeld bij het bevolkingsregister van zijn of haar woongemeente. Bovendien gaat het om de verhuizing van een persoon en niet, zoals de term misschien doet vermoeden, om de verhuizing van een huishouden. Wijzigingen van adres door wijziging van straatnaam, huisnummer, gemeentelijke herindeling of iets dergelijks worden niet als verhuizing beschouwd.

Begrippen CBS
type: ConceptScheme
preferred label: Concepts Statistics Netherlands @en