Bedrijven
type: Concept
narrower: Kosten van overige diensten

CBS begrip
label: CBS concept @en

Kosten van overige diensten
type: Concept
type: CBS begrip
created: 2016-03-23T09:19:10Z
modified: 2022-02-23T15:54:10Z
source: kosten-van-overige-diensten
version info: 1
broader: Bedrijven
definition: De kosten van diensten verleend door derden voor zover nergens anders genoemd.
definition: Costs of services provided by others not classified elsewhere. @en
in scheme: Begrippen CBS
preferred label: Costs of other services @en
scope note: Deze kosten omvatten ondermeer: - bankkosten (exclusief rentekosten en/of valutaverliezen); - aan derden afgedragen premies voor verzekering (voor zover nergens anders genoemd); - kosten accountants/ administratie/ advies/ rechtshulp en dergelijke; - kosten van automatiserings- en computerdiensten door derden, inclusief de waarde van in het boekjaar aangekochte hard- en software, tenzij de hard- en/of software is geactiveerd; - apart betaalde vrachtkosten op inkopen; - kosten vuilafvoer en vuilverwerking. Vanaf 2006 worden bij de Productiestatistieken de kosten van speur- en ontwikkelingswerk door derden gerekend tot deze rubriek.

Begrippen CBS
type: ConceptScheme
preferred label: Concepts Statistics Netherlands @en