Internationale handel
type: Concept
narrower: Energie (IH)

CBS begrip
label: CBS concept @en

Energie (IH)
type: Concept
type: CBS begrip
created: 2016-03-23T09:09:04Z
modified: 2022-02-23T15:53:24Z
source: energie--ih--
version info: 1
broader: Internationale handel
definition: Het totaal van grondstoffen en producten dat volgens de Gecombineerde Nomenclatuur (GN, ofwel goederennaamlijst voor de internationale handel) wordt geregistreerd onder hoofdstuk 27, de statistieknummers 29022000 t/m 29029090 en de tariefposten 3403 en 3811. Hieronder vallen onder meer ruwe aardolie, aardolieproducten, aardgas, steenkool en elektriciteit.
definition: The total of raw materials and products registered under the Combined Nomenclature for international trade (chapter 27 numbers 29022000-29029080 and tariffs 3403 and 3811). This includes crude oil, oil products, gas, coal and electricity. @en
in scheme: Begrippen CBS
preferred label: Energy (foreign trade) @en

Begrippen CBS
type: ConceptScheme
preferred label: Concepts Statistics Netherlands @en