Zorg en gezondheid
type: Concept
narrower: Jeugdhulp

CBS begrip
label: CBS concept @en

Gemeentelijke jeugdzorg
type: Concept
type: CBS begrip
related: Jeugdhulp

Jeugdhulp
type: Concept
type: CBS begrip
created: 2017-12-01T12:12:29Z
modified: 2022-02-23T15:54:04Z
source: jeugdhulp
version info: 1
broader: Zorg en gezondheid
definition: Hulp en zorg aan jongeren en hun ouders bij psychische, psychosociale en of gedragsproblemen, een verstandelijke beperking van de jongere of opvoedingsproblemen van de ouders.
in scheme: Begrippen CBS
related: Gemeentelijke jeugdzorg
scope note: Het betreft hulp en zorg zoals deze bedoeld en beschreven is in de Jeugdwet (2014).

Begrippen CBS
type: ConceptScheme
preferred label: Concepts Statistics Netherlands @en