Overheid en politiek
type: Concept
narrower: Sector overheid

CBS begrip
label: CBS concept @en

Wettelijke sociale verzekeringsinstellingen
type: Concept
type: CBS begrip
preferred label: Sector social security funds @en
related: Sector overheid

Sector centrale overheid
type: Concept
type: CBS begrip
preferred label: Sector central government @en
related: Sector overheid

Institutionele sector
type: Concept
type: CBS begrip
preferred label: Institutional sector @en
related: Sector overheid

Sector verzekeringsinstellingen en pensioenfondsen
type: Concept
type: CBS begrip
preferred label: Sector insurance corporations @en
related: Sector overheid

Sector lokale overheid
type: Concept
type: CBS begrip
preferred label: Sector local government @en
related: Sector overheid

Sector overheid
type: Concept
type: CBS begrip
created: 2016-03-23T09:05:13Z
modified: 2023-03-29T15:52:14Z
source: sector-overheid
version info: 2
alternative label: Overheid
broader: Overheid en politiek
definition: The institutional sector of the economy that makes most of its output available for free or for prices that are not economically significant. The costs are mainly financed from payments by units from other sectors. The output is for individual or collective use. Furthermore the sector comprises all institutions that carry out the redistribution of national income and wealth. @en
definition: De overheid bestaat ten eerste uit eenheden die uitvoerende, wetgevende en rechterlijke bevoegdheden op nationaal of regionaal niveau hebben. Zij hebben daarmee de bevoegdheid belastingen en andere verplichte heffingen op te leggen en wetten vast te stellen die het gedrag van economische eenheden beïnvloeden. Het gaat hierbij in Nederland om de Rijksoverheid, gemeenten, provincies, waterschappen en dergelijke. Daarnaast worden die instellingen tot de overheid gerekend waarvan eerder genoemde eenheden overheersend zeggenschap hebben over het algemene bedrijfsbeleid en die niet tegen marktprijzen produceren.
history note: De definitie is aangepast
in scheme: Begrippen CBS
note: Vorige definitie: Het geheel van het Rijk, de provincies, de gemeenten, de samenwerkingsverbanden op grond van de Wet Gemeenschappelijke Regelingen, de waterschappen en de publiekrechtelijke bedrijfsorganisaties.Deze sector bestaat verder uit instellingen die gecontroleer
preferred label: Sector general government @en
related: Institutionele sector
related: Wettelijke sociale verzekeringsinstellingen
related: Sector lokale overheid
related: Sector verzekeringsinstellingen en pensioenfondsen
related: Sector centrale overheid
scope note: De sector overheid bestaat uit drie subsectoren: centrale overheid, lokale overheid en socialezekerheidsfondsen. Een andere naam voor de sector overheid is collectieve sector.

Begrippen CBS
type: ConceptScheme
preferred label: Concepts Statistics Netherlands @en