Vrije tijd en cultuur
type: Concept
narrower: Streekarchief

CBS begrip
label: CBS concept @en

Streekarchief
type: Concept
type: CBS begrip
created: 2016-03-23T09:11:26Z
modified: 2022-02-23T15:55:39Z
source: streekarchief
version info: 1
broader: Vrije tijd en cultuur
definition: Een archief van samenwerkende gemeenten en/of waterschappen, ondergebracht in een gemeenschappelijke bewaarplaats en beheerd door een daartoe aangestelde archivaris.
definition: An archive of various municipalities and/or water boards brought together in a common building and managed by an appointed archivist. @en
in scheme: Begrippen CBS
preferred label: Regional archive centre @en

Begrippen CBS
type: ConceptScheme
preferred label: Concepts Statistics Netherlands @en