Bedrijven
type: Concept
narrower: Bedrijf

CBS begrip
label: CBS concept @en

Kind-of-activity unit
type: Concept
type: CBS begrip
related: Bedrijf

Juridische eenheid
type: Concept
type: CBS begrip
preferred label: Legal entity @en
related: Bedrijf

Ondernemingengroep
type: Concept
type: CBS begrip
preferred label: Enterprise group @en
related: Bedrijf

Onderneming
type: Concept
type: CBS begrip
preferred label: Enterprise group @en
related: Bedrijf

Bedrijf
type: Concept
type: CBS begrip
created: 2016-03-23T09:03:51Z
modified: 2022-02-23T15:52:35Z
source: bedrijf
version info: 1
broader: Bedrijven
definition: De feitelijke transactor in het productieproces gekenmerkt door zelfstandigheid ten aanzien van de beslissingen over dat proces en door het aanbieden van zijn producten aan derden.
definition: The actual transactor in the production process characterised by independence in decisions about the process and by providing products to others. @en
in scheme: Begrippen CBS
preferred label: Enterprise @en
related: Juridische eenheid
related: Ondernemingengroep
related: Onderneming
related: Kind-of-activity unit
scope note: Een bedrijf bestaat uit een of meer juridische eenheden. Een juridische eenheid kan zelf weer uit een of meer vestigingen bestaan. Kenmerkend is dat er autonomie is over beslissingen met betrekking tot de productie binnen deze (samengestelde) entiteit. Wanneer deze eenheid zich uitstrekt over verschillende landen wordt omwille van de nationale statistiek het Nederlandse deel als bedrijf beschouwd. In de officiële CBS-terminologie wordt het bedrijf zoals hier gedefinieerd bedrijfseenheid (BE) genoemd. Zo kan geen verwarring ontstaan met de term bedrijf uit het gangbare spraakgebruik. De statistische eenheid bedrijf is een benadering van de kind-of-activity unit, zoals gedefinieerd door Eurostat. Deze definitie combineert twee eisen die strijdig kunnen zijn: bijdragen aan één activiteit versus het overeenkomen met één of meer operationele eenheden. Nederland geeft bij het operationaliseren naar de statistische eenheid bedrijf prioriteit aan de tweede eis.

Begrippen CBS
type: ConceptScheme
preferred label: Concepts Statistics Netherlands @en